{"text_format":"3","workbook":"xlsx","n_sheets":12,"sheets":["Instructions","Paris_Company_Performance ","Tokyo_Company_Performance","Inspections_Database","Fleet_List","Data_Validation","Insp&Def Chart Table","Montly_Performance (Tokyo)","Montly_Performance","Analysis of Inspections","Analysis of Deficiencies","ChartTable"],"not_rendered":{"charts":8,"images":31,"macros":1,"defined_names":5,"comments":1},"unopened":[{"sheet":"Montly_Performance (Tokyo)","index":7,"reason":"not_a_worksheet"},{"sheet":"Montly_Performance","index":8,"reason":"not_a_worksheet"},{"sheet":"Analysis of Inspections","index":9,"reason":"not_a_worksheet"},{"sheet":"Analysis of Deficiencies","index":10,"reason":"not_a_worksheet"}],"read":"whole","date_system":"1900"}

{"sheet":"Instructions","index":0,"n_rows":82,"n_cols":14,"rows_kept":82,"merged":[[14,2,14,15],[16,2,16,15],[18,2,18,15],[21,0,21,18],[57,1,57,3],[57,5,57,7],[57,9,57,11],[57,13,57,15],[58,1,58,3],[58,5,58,7],[58,9,58,11],[58,13,58,15],[59,1,59,3],[59,5,59,7],[59,9,59,11],[59,13,59,15],[62,1,62,3],[62,4,62,7],[62,9,62,11],[62,12,62,15],[63,1,63,3],[63,4,63,7],[63,9,63,11],[63,12,63,15],[64,1,64,3],[64,4,64,7],[64,9,64,11],[64,12,64,15],[67,0,67,18],[78,0,78,4],[80,0,80,17],[81,0,83,17]]}
[]
[]
[]
[]
["How does the Company Performance Calculator Works?"]
[]
["The calculations use only data for the last 36 months. Data from inspections carried out prior to 36 months from today will not be taken into account for the calculations or charts."]
[]
["In order for the calculation to work, the following information must be entered:"]
[]
{"$rows_left_out":47}
{"sheet":"Paris_Company_Performance ","index":1,"n_rows":49,"n_cols":16,"rows_kept":49,"merged":[[0,2,5,14],[16,12,16,14],[17,12,17,14],[18,12,18,14],[18,15,21,15],[19,12,19,14],[20,12,20,14],[21,12,21,14],[22,12,22,14],[22,15,24,15],[23,12,23,14],[24,12,24,14],[25,12,25,14],[32,0,32,2],[32,3,32,6],[32,7,32,9],[32,10,32,11],[32,12,32,14],[32,15,32,16],[36,1,36,7],[36,11,36,15],[37,11,37,15],[40,0,41,15],[47,0,47,17],[48,0,50,17]]}
[null,null,"Paris MoU Company Performance Calculator "]
[]
[]
[]
[]
[]
[]
["The Company Performance Calculator evaluates the performance of the companies referred in the European Union Directive 2009/16/EC on Port State Control Annex 1, Part 1 "]
[]
["This Calculator is only a tool to help users and is without prejudice to Directive 2009/16/EC. Therefore, it cannot have legal effects."]
{"$rows_left_out":40}
{"sheet":"Tokyo_Company_Performance","index":2,"n_rows":49,"n_cols":16,"rows_kept":49,"merged":[[0,2,5,14],[16,12,16,14],[17,12,17,14],[18,12,18,14],[18,15,21,15],[19,12,19,14],[20,12,20,14],[21,12,21,14],[22,12,22,14],[22,15,24,15],[23,12,23,14],[24,12,24,14],[25,12,25,14],[32,0,32,2],[32,3,32,6],[32,7,32,9],[32,10,32,11],[32,12,32,14],[32,15,32,16],[36,1,36,7],[36,11,36,15],[37,11,37,15],[39,0,39,15],[47,0,47,17],[48,0,50,17]]}
[null,null,"Tokyo MoU Company Performance Calculator "]
{"$rows_empty":8}
["This Calculator is only a tool to help users and is without prejudice to Directive 2009/16/EC."]
[]
[]
[]
[null,null,"Company Inspection history from the last 36 months:",{"$nulls":8},"Company Performance"]
[]
[]
[{"$nulls":11},"Detention Index","Deficiency Index",null,null,"Company Performance"]
{"$rows_left_out":33}
{"sheet":"Inspections_Database","index":3,"n_rows":1,"n_cols":10,"rows_kept":1}
["Ship Name","IMO Number","Port of Inspection","MOU","Date of Inspection","N° of Non ISM deficiencies","N° of ISM Deficiencies","Vessel Detained? Yes/No","Refusal of Access Issued? Yes/No","Comments"]

{"sheet":"Fleet_List","index":4,"n_rows":1,"n_cols":2,"rows_kept":1}
["Ship Name","IMO Number"]

{"sheet":"Data_Validation","index":5,"n_rows":64,"n_cols":9,"rows_kept":64,"hidden":true}
["Abuja MOU","Ship Name","Paris NonISM Def Count","Paris ISM Def Count","Tokyo NonISM Def Count","Tokyo ISM Def Count","Paris PSC Detention Ratio","Paris PSC Deficiency Ratio","Date"]
["Black Sea MOU",null,{"$f":"IF(AND(Inspections_Database!E2>='Insp&Def Chart Table'!$J$2,Inspections_Database!D2=\"Paris MOU\"),Inspections_Database!F2,0)","v":0},{"$f":"IF(AND(Inspections_Database!E2>='Insp&Def Chart Table'!$J$2,Inspections_Database!D2=\"Paris MOU\"),Inspections_Database!G2,0)","v":0},{"$f":"IF(AND(Inspections_Database!E2>='Insp&Def Chart Table'!$J$2,Inspections_Database!D2=\"Tokyo MOU\"),Inspections_Database!F2,0)","v":0},{"$f":"IF(AND(Inspections_Database!E2>='Insp&Def Chart Table'!$J$2,Inspections_Database!D2=\"Tokyo MOU\"),Inspections_Database!G2,0)","v":0},3.67,3.06,"2017-01-07"]
["Caribbean MOU",null,{"$f":"IF(AND(Inspections_Database!E3>='Insp&Def Chart Table'!$J$2,Inspections_Database!D3=\"Paris MOU\"),Inspections_Database!F3,0)","v":0},{"$f":"IF(AND(Inspections_Database!E3>='Insp&Def Chart Table'!$J$2,Inspections_Database!D3=\"Paris MOU\"),Inspections_Database!G3,0)","v":0},{"$f":"IF(AND(Inspections_Database!E3>='Insp&Def Chart Table'!$J$2,Inspections_Database!D3=\"Tokyo MOU\"),Inspections_Database!F3,0)","v":0},{"$f":"IF(AND(Inspections_Database!E3>='Insp&Def Chart Table'!$J$2,Inspections_Database!D3=\"Tokyo MOU\"),Inspections_Database!G3,0)","v":0}]
["Indian Ocean MOU",null,{"$f":"IF(AND(Inspections_Database!E4>='Insp&Def Chart Table'!$J$2,Inspections_Database!D4=\"Paris MOU\"),Inspections_Database!F4,0)","v":0},{"$f":"IF(AND(Inspections_Database!E4>='Insp&Def Chart Table'!$J$2,Inspections_Database!D4=\"Paris MOU\"),Inspections_Database!G4,0)","v":0},{"$f":"IF(AND(Inspections_Database!E4>='Insp&Def Chart Table'!$J$2,Inspections_Database!D4=\"Tokyo MOU\"),Inspections_Database!F4,0)","v":0},{"$f":"IF(AND(Inspections_Database!E4>='Insp&Def Chart Table'!$J$2,Inspections_Database!D4=\"Tokyo MOU\"),Inspections_Database!G4,0)","v":0},"Tokyo PSC Detention Ratio","Tokyo PSC Deficiency Ratio"]
["Mediterranean MOU",null,{"$f":"IF(AND(Inspections_Database!E5>='Insp&Def Chart Table'!$J$2,Inspections_Database!D5=\"Paris MOU\"),Inspections_Database!F5,0)","v":0},{"$f":"IF(AND(Inspections_Database!E5>='Insp&Def Chart Table'!$J$2,Inspections_Database!D5=\"Paris MOU\"),Inspections_Database!G5,0)","v":0},{"$f":"IF(AND(Inspections_Database!E5>='Insp&Def Chart Table'!$J$2,Inspections_Database!D5=\"Tokyo MOU\"),Inspections_Database!F5,0)","v":0},{"$f":"IF(AND(Inspections_Database!E5>='Insp&Def Chart Table'!$J$2,Inspections_Database!D5=\"Tokyo MOU\"),Inspections_Database!G5,0)","v":0},"Detention Index: 3.69%","Deficiency Index: 3.07"]
["Paris MOU",null,{"$f":"IF(AND(Inspections_Database!E6>='Insp&Def Chart Table'!$J$2,Inspections_Database!D6=\"Paris MOU\"),Inspections_Database!F6,0)","v":0},{"$f":"IF(AND(Inspections_Database!E6>='Insp&Def Chart Table'!$J$2,Inspections_Database!D6=\"Paris MOU\"),Inspections_Database!G6,0)","v":0},{"$f":"IF(AND(Inspections_Database!E6>='Insp&Def Chart Table'!$J$2,Inspections_Database!D6=\"Tokyo MOU\"),Inspections_Database!F6,0)","v":0},{"$f":"IF(AND(Inspections_Database!E6>='Insp&Def Chart Table'!$J$2,Inspections_Database!D6=\"Tokyo MOU\"),Inspections_Database!G6,0)","v":0},{"$f":"ExtractNumber(G5,TRUE)","v":3.69},{"$f":"ExtractNumber(H5,TRUE)","v":3.07},"2018-01-07"]
["Riyadh MOU",null,{"$f":"IF(AND(Inspections_Database!E7>='Insp&Def Chart Table'!$J$2,Inspections_Database!D7=\"Paris MOU\"),Inspections_Database!F7,0)","v":0},{"$f":"IF(AND(Inspections_Database!E7>='Insp&Def Chart Table'!$J$2,Inspections_Database!D7=\"Paris MOU\"),Inspections_Database!G7,0)","v":0},{"$f":"IF(AND(Inspections_Database!E7>='Insp&Def Chart Table'!$J$2,Inspections_Database!D7=\"Tokyo MOU\"),Inspections_Database!F7,0)","v":0},{"$f":"IF(AND(Inspections_Database!E7>='Insp&Def Chart Table'!$J$2,Inspections_Database!D7=\"Tokyo MOU\"),Inspections_Database!G7,0)","v":0}]
["Tokyo MOU",null,{"$f":"IF(AND(Inspections_Database!E8>='Insp&Def Chart Table'!$J$2,Inspections_Database!D8=\"Paris MOU\"),Inspections_Database!F8,0)","v":0},{"$f":"IF(AND(Inspections_Database!E8>='Insp&Def Chart Table'!$J$2,Inspections_Database!D8=\"Paris MOU\"),Inspections_Database!G8,0)","v":0},{"$f":"IF(AND(Inspections_Database!E8>='Insp&Def Chart Table'!$J$2,Inspections_Database!D8=\"Tokyo MOU\"),Inspections_Database!F8,0)","v":0},{"$f":"IF(AND(Inspections_Database!E8>='Insp&Def Chart Table'!$J$2,Inspections_Database!D8=\"Tokyo MOU\"),Inspections_Database!G8,0)","v":0}]
["US Coast Guard",null,{"$f":"IF(AND(Inspections_Database!E9>='Insp&Def Chart Table'!$J$2,Inspections_Database!D9=\"Paris MOU\"),Inspections_Database!F9,0)","v":0},{"$f":"IF(AND(Inspections_Database!E9>='Insp&Def Chart Table'!$J$2,Inspections_Database!D9=\"Paris MOU\"),Inspections_Database!G9,0)","v":0},{"$f":"IF(AND(Inspections_Database!E9>='Insp&Def Chart Table'!$J$2,Inspections_Database!D9=\"Tokyo MOU\"),Inspections_Database!F9,0)","v":0},{"$f":"IF(AND(Inspections_Database!E9>='Insp&Def Chart Table'!$J$2,Inspections_Database!D9=\"Tokyo MOU\"),Inspections_Database!G9,0)","v":0}]
["Vina del Mar MOU",null,{"$f":"IF(AND(Inspections_Database!E10>='Insp&Def Chart Table'!$J$2,Inspections_Database!D10=\"Paris MOU\"),Inspections_Database!F10,0)","v":0},{"$f":"IF(AND(Inspections_Database!E10>='Insp&Def Chart Table'!$J$2,Inspections_Database!D10=\"Paris MOU\"),Inspections_Database!G10,0)","v":0},{"$f":"IF(AND(Inspections_Database!E10>='Insp&Def Chart Table'!$J$2,Inspections_Database!D10=\"Tokyo MOU\"),Inspections_Database!F10,0)","v":0},{"$f":"IF(AND(Inspections_Database!E10>='Insp&Def Chart Table'!$J$2,Inspections_Database!D10=\"Tokyo MOU\"),Inspections_Database!G10,0)","v":0}]
{"$rows_left_out":55}
{"sheet":"Insp&Def Chart Table","index":6,"n_rows":12,"n_cols":21,"rows_kept":12,"hidden":true}
[null,null,"Ship Name","Paris - Inspections","Paris - Detentions","Tokyo - Inspections","Tokyo - Detentions",{"$nulls":8},"Paris - Non ISM Def","Paris - ISM Def","Tokyo - Non ISM Def","Tokyo - ISM Def"]
[{"$nulls":3},{"$f":"COUNTIFS(Inspections_Database!$E$2:$E$5000,\">\"&$J$2,Inspections_Database!$E$2:$E$5000,\"<\"&$K$2,Inspections_Database!$D$2:$D$5000,\"Paris MOU\",Inspections_Database!$A$2:$A$5000,Fleet_List!A2)","v":0},{"$f":"COUNTIFS(Inspections_Database!$E$2:$E$5000,\">\"&$J$2,Inspections_Database!$E$2:$E$5000,\"<\"&$K$2,Inspections_Database!$A$2:$A$5000,Fleet_List!$A$2:$A$300,Inspections_Database!$H$2:$H$5000,\"Yes\",Inspections_Database!$D$2:$D$5000,\"Paris MOU\")","v":0},{"$f":"COUNTIFS(Inspections_Database!$E$2:$E$5000,\">\"&$J$2,Inspections_Database!$E$2:$E$5000,\"<\"&$K$2,Inspections_Database!$D$2:$D$5000,\"Tokyo MOU\",Inspections_Database!$A$2:$A$5000,Fleet_List!A2)","v":0},{"$f":"COUNTIFS(Inspections_Database!$E$2:$E$5000,\">\"&$J$2,Inspections_Database!$E$2:$E$5000,\"<\"&$K$2,Inspections_Database!$A$2:$A$5000,Fleet_List!$A$2:$A$300,Inspections_Database!$H$2:$H$5000,\"Yes\",Inspections_Database!$D$2:$D$5000,\"Tokyo MOU\")","v":0},{"$f":"COUNTIFS(Inspections_Database!E2:E14,\">\"&J2,Inspections_Database!E2:E14,\"<\"&K2,Inspections_Database!A2:A14,Fleet_List!A2)","v":0},null,"2014-09-24","2017-09-26",{"$nulls":4},{"$f":"SUMIF(Data_Validation!$B$2:$B$7000,Fleet_List!$A$2:$A$257,Data_Validation!$C$2:$C$7000)","v":0},{"$f":"SUMIF(Data_Validation!$B$2:$B$7000,Fleet_List!$A$2:$A$257,Data_Validation!$D$2:$D$7000)","v":0},{"$f":"SUMIF(Data_Validation!$B$2:$B$7000,Fleet_List!$A$2:$A$257,Data_Validation!$E$2:$E$7000)","v":0},{"$f":"SUMIF(Data_Validation!$B$2:$B$7000,Fleet_List!$A$2:$A$257,Data_Validation!$F$2:$F$7000)","v":0},{"$f":"SUMIF(Data_Validation!$B$2:$B$7000,Fleet_List!$A$2:$A$250,Data_Validation!$E$2:$E$7000)","v":0},{"$f":"SUMIF(Data_Validation!$B$2:$B$7000,Fleet_List!$A$2:$A$250,Data_Validation!$F$2:$F$7000)","v":0}]
[{"$nulls":3},{"$f":"COUNTIFS(Inspections_Database!$E$2:$E$5000,\">\"&$J$2,Inspections_Database!$E$2:$E$5000,\"<\"&$K$2,Inspections_Database!$D$2:$D$5000,\"Paris MOU\",Inspections_Database!$A$2:$A$5000,Fleet_List!A3)","v":0},{"$f":"COUNTIFS(Inspections_Database!$E$2:$E$5000,\">\"&$J$2,Inspections_Database!$E$2:$E$5000,\"<\"&$K$2,Inspections_Database!$A$2:$A$5000,Fleet_List!$A$2:$A$300,Inspections_Database!$H$2:$H$5000,\"Yes\",Inspections_Database!$D$2:$D$5000,\"Paris MOU\")","v":0},{"$f":"COUNTIFS(Inspections_Database!$E$2:$E$5000,\">\"&$J$2,Inspections_Database!$E$2:$E$5000,\"<\"&$K$2,Inspections_Database!$D$2:$D$5000,\"Tokyo MOU\",Inspections_Database!$A$2:$A$5000,Fleet_List!A3)","v":0},{"$f":"COUNTIFS(Inspections_Database!$E$2:$E$5000,\">\"&$J$2,Inspections_Database!$E$2:$E$5000,\"<\"&$K$2,Inspections_Database!$A$2:$A$5000,Fleet_List!$A$2:$A$300,Inspections_Database!$H$2:$H$5000,\"Yes\",Inspections_Database!$D$2:$D$5000,\"Tokyo MOU\")","v":0},{"$f":"COUNTIFS(Inspections_Database!$E$2:$E$2982,\">\"&$J$2,Inspections_Database!$E$2:$E$2982,\"<\"&$K$2,Inspections_Database!$A$2:$A$2982,Fleet_List!$A$2:$A$291,Inspections_Database!$H$2:$H$2982,\"Yes\")","v":0},{"$nulls":7},{"$f":"SUMIF(Data_Validation!$B$2:$B$7000,Fleet_List!$A$2:$A$257,Data_Validation!$C$2:$C$7000)","v":0},{"$f":"SUMIF(Data_Validation!$B$2:$B$7000,Fleet_List!$A$2:$A$257,Data_Validation!$D$2:$D$7000)","v":0},{"$f":"SUMIF(Data_Validation!$B$2:$B$7000,Fleet_List!$A$2:$A$257,Data_Validation!$E$2:$E$7000)","v":0},{"$f":"SUMIF(Data_Validation!$B$2:$B$7000,Fleet_List!$A$2:$A$257,Data_Validation!$F$2:$F$7000)","v":0},{"$f":"SUMIF(Data_Validation!$B$2:$B$7000,Fleet_List!$A$2:$A$250,Data_Validation!$E$2:$E$7000)","v":0},{"$f":"SUMIF(Data_Validation!$B$2:$B$7000,Fleet_List!$A$2:$A$250,Data_Validation!$F$2:$F$7000)","v":0}]
[{"$nulls":3},{"$f":"COUNTIFS(Inspections_Database!$E$2:$E$5000,\">\"&$J$2,Inspections_Database!$E$2:$E$5000,\"<\"&$K$2,Inspections_Database!$D$2:$D$5000,\"Paris MOU\",Inspections_Database!$A$2:$A$5000,Fleet_List!A4)","v":0},{"$f":"COUNTIFS(Inspections_Database!$E$2:$E$5000,\">\"&$J$2,Inspections_Database!$E$2:$E$5000,\"<\"&$K$2,Inspections_Database!$A$2:$A$5000,Fleet_List!$A$2:$A$300,Inspections_Database!$H$2:$H$5000,\"Yes\",Inspections_Database!$D$2:$D$5000,\"Paris MOU\")","v":0},{"$f":"COUNTIFS(Inspections_Database!$E$2:$E$5000,\">\"&$J$2,Inspections_Database!$E$2:$E$5000,\"<\"&$K$2,Inspections_Database!$D$2:$D$5000,\"Tokyo MOU\",Inspections_Database!$A$2:$A$5000,Fleet_List!A4)","v":0},{"$f":"COUNTIFS(Inspections_Database!$E$2:$E$5000,\">\"&$J$2,Inspections_Database!$E$2:$E$5000,\"<\"&$K$2,Inspections_Database!$A$2:$A$5000,Fleet_List!$A$2:$A$300,Inspections_Database!$H$2:$H$5000,\"Yes\",Inspections_Database!$D$2:$D$5000,\"Tokyo MOU\")","v":0},{"$nulls":8},{"$f":"SUMIF(Data_Validation!$B$2:$B$7000,Fleet_List!$A$2:$A$257,Data_Validation!$C$2:$C$7000)","v":0},{"$f":"SUMIF(Data_Validation!$B$2:$B$7000,Fleet_List!$A$2:$A$257,Data_Validation!$D$2:$D$7000)","v":0},{"$f":"SUMIF(Data_Validation!$B$2:$B$7000,Fleet_List!$A$2:$A$257,Data_Validation!$E$2:$E$7000)","v":0},{"$f":"SUMIF(Data_Validation!$B$2:$B$7000,Fleet_List!$A$2:$A$257,Data_Validation!$F$2:$F$7000)","v":0},{"$f":"SUMIF(Data_Validation!$B$2:$B$7000,Fleet_List!$A$2:$A$250,Data_Validation!$E$2:$E$7000)","v":0},{"$f":"SUMIF(Data_Validation!$B$2:$B$7000,Fleet_List!$A$2:$A$250,Data_Validation!$F$2:$F$7000)","v":0}]
[{"$nulls":3},{"$f":"COUNTIFS(Inspections_Database!$E$2:$E$5000,\">\"&$J$2,Inspections_Database!$E$2:$E$5000,\"<\"&$K$2,Inspections_Database!$D$2:$D$5000,\"Paris MOU\",Inspections_Database!$A$2:$A$5000,Fleet_List!A5)","v":0},{"$f":"COUNTIFS(Inspections_Database!$E$2:$E$5000,\">\"&$J$2,Inspections_Database!$E$2:$E$5000,\"<\"&$K$2,Inspections_Database!$A$2:$A$5000,Fleet_List!$A$2:$A$300,Inspections_Database!$H$2:$H$5000,\"Yes\",Inspections_Database!$D$2:$D$5000,\"Paris MOU\")","v":0},{"$f":"COUNTIFS(Inspections_Database!$E$2:$E$5000,\">\"&$J$2,Inspections_Database!$E$2:$E$5000,\"<\"&$K$2,Inspections_Database!$D$2:$D$5000,\"Tokyo MOU\",Inspections_Database!$A$2:$A$5000,Fleet_List!A5)","v":0},{"$f":"COUNTIFS(Inspections_Database!$E$2:$E$5000,\">\"&$J$2,Inspections_Database!$E$2:$E$5000,\"<\"&$K$2,Inspections_Database!$A$2:$A$5000,Fleet_List!$A$2:$A$300,Inspections_Database!$H$2:$H$5000,\"Yes\",Inspections_Database!$D$2:$D$5000,\"Tokyo MOU\")","v":0},{"$nulls":8},{"$f":"SUMIF(Data_Validation!$B$2:$B$7000,Fleet_List!$A$2:$A$257,Data_Validation!$C$2:$C$7000)","v":0},{"$f":"SUMIF(Data_Validation!$B$2:$B$7000,Fleet_List!$A$2:$A$257,Data_Validation!$D$2:$D$7000)","v":0},{"$f":"SUMIF(Data_Validation!$B$2:$B$7000,Fleet_List!$A$2:$A$257,Data_Validation!$E$2:$E$7000)","v":0},{"$f":"SUMIF(Data_Validation!$B$2:$B$7000,Fleet_List!$A$2:$A$257,Data_Validation!$F$2:$F$7000)","v":0},{"$f":"SUMIF(Data_Validation!$B$2:$B$7000,Fleet_List!$A$2:$A$250,Data_Validation!$E$2:$E$7000)","v":0},{"$f":"SUMIF(Data_Validation!$B$2:$B$7000,Fleet_List!$A$2:$A$250,Data_Validation!$F$2:$F$7000)","v":0}]
[{"$nulls":3},{"$f":"COUNTIFS(Inspections_Database!$E$2:$E$5000,\">\"&$J$2,Inspections_Database!$E$2:$E$5000,\"<\"&$K$2,Inspections_Database!$D$2:$D$5000,\"Paris MOU\",Inspections_Database!$A$2:$A$5000,Fleet_List!#REF!)","v":0},{"$f":"COUNTIFS(Inspections_Database!$E$2:$E$5000,\">\"&$J$2,Inspections_Database!$E$2:$E$5000,\"<\"&$K$2,Inspections_Database!$A$2:$A$5000,Fleet_List!$A$2:$A$296,Inspections_Database!$H$2:$H$5000,\"Yes\",Inspections_Database!$D$2:$D$5000,\"Paris MOU\")","v":0},{"$f":"COUNTIFS(Inspections_Database!$E$2:$E$5000,\">\"&$J$2,Inspections_Database!$E$2:$E$5000,\"<\"&$K$2,Inspections_Database!$D$2:$D$5000,\"Tokyo MOU\",Inspections_Database!$A$2:$A$5000,Fleet_List!#REF!)","v":0},{"$f":"COUNTIFS(Inspections_Database!$E$2:$E$5000,\">\"&$J$2,Inspections_Database!$E$2:$E$5000,\"<\"&$K$2,Inspections_Database!$A$2:$A$5000,Fleet_List!$A$2:$A$296,Inspections_Database!$H$2:$H$5000,\"Yes\",Inspections_Database!$D$2:$D$5000,\"Tokyo MOU\")","v":0},{"$nulls":8},{"$f":"SUMIF(Data_Validation!$B$2:$B$7000,Fleet_List!$A$2:$A$253,Data_Validation!$C$2:$C$7000)","v":0},{"$f":"SUMIF(Data_Validation!$B$2:$B$7000,Fleet_List!$A$2:$A$253,Data_Validation!$D$2:$D$7000)","v":0},{"$f":"SUMIF(Data_Validation!$B$2:$B$7000,Fleet_List!$A$2:$A$253,Data_Validation!$E$2:$E$7000)","v":0},{"$f":"SUMIF(Data_Validation!$B$2:$B$7000,Fleet_List!$A$2:$A$253,Data_Validation!$F$2:$F$7000)","v":0},{"$f":"SUMIF(Data_Validation!$B$2:$B$7000,Fleet_List!$A$2:$A$250,Data_Validation!$E$2:$E$7000)","v":0},{"$f":"SUMIF(Data_Validation!$B$2:$B$7000,Fleet_List!$A$2:$A$250,Data_Validation!$F$2:$F$7000)","v":0}]
[{"$nulls":3},{"$f":"COUNTIFS(Inspections_Database!$E$2:$E$5000,\">\"&$J$2,Inspections_Database!$E$2:$E$5000,\"<\"&$K$2,Inspections_Database!$D$2:$D$5000,\"Paris MOU\",Inspections_Database!$A$2:$A$5000,Fleet_List!A3)","v":0},{"$f":"COUNTIFS(Inspections_Database!$E$2:$E$5000,\">\"&$J$2,Inspections_Database!$E$2:$E$5000,\"<\"&$K$2,Inspections_Database!$A$2:$A$5000,Fleet_List!$A$2:$A$296,Inspections_Database!$H$2:$H$5000,\"Yes\",Inspections_Database!$D$2:$D$5000,\"Paris MOU\")","v":0},{"$f":"COUNTIFS(Inspections_Database!$E$2:$E$5000,\">\"&$J$2,Inspections_Database!$E$2:$E$5000,\"<\"&$K$2,Inspections_Database!$D$2:$D$5000,\"Tokyo MOU\",Inspections_Database!$A$2:$A$5000,Fleet_List!A3)","v":0},{"$f":"COUNTIFS(Inspections_Database!$E$2:$E$5000,\">\"&$J$2,Inspections_Database!$E$2:$E$5000,\"<\"&$K$2,Inspections_Database!$A$2:$A$5000,Fleet_List!$A$2:$A$296,Inspections_Database!$H$2:$H$5000,\"Yes\",Inspections_Database!$D$2:$D$5000,\"Tokyo MOU\")","v":0},{"$nulls":8},{"$f":"SUMIF(Data_Validation!$B$2:$B$7000,Fleet_List!$A$2:$A$253,Data_Validation!$C$2:$C$7000)","v":0},{"$f":"SUMIF(Data_Validation!$B$2:$B$7000,Fleet_List!$A$2:$A$253,Data_Validation!$D$2:$D$7000)","v":0},{"$f":"SUMIF(Data_Validation!$B$2:$B$7000,Fleet_List!$A$2:$A$253,Data_Validation!$E$2:$E$7000)","v":0},{"$f":"SUMIF(Data_Validation!$B$2:$B$7000,Fleet_List!$A$2:$A$253,Data_Validation!$F$2:$F$7000)","v":0},{"$f":"SUMIF(Data_Validation!$B$2:$B$7000,Fleet_List!$A$2:$A$250,Data_Validation!$E$2:$E$7000)","v":0},{"$f":"SUMIF(Data_Validation!$B$2:$B$7000,Fleet_List!$A$2:$A$250,Data_Validation!$F$2:$F$7000)","v":0}]
[{"$nulls":3},{"$f":"COUNTIFS(Inspections_Database!$E$2:$E$5000,\">\"&$J$2,Inspections_Database!$E$2:$E$5000,\"<\"&$K$2,Inspections_Database!$D$2:$D$5000,\"Paris MOU\",Inspections_Database!$A$2:$A$5000,Fleet_List!A4)","v":0},{"$f":"COUNTIFS(Inspections_Database!$E$2:$E$5000,\">\"&$J$2,Inspections_Database!$E$2:$E$5000,\"<\"&$K$2,Inspections_Database!$A$2:$A$5000,Fleet_List!$A$2:$A$296,Inspections_Database!$H$2:$H$5000,\"Yes\",Inspections_Database!$D$2:$D$5000,\"Paris MOU\")","v":0},{"$f":"COUNTIFS(Inspections_Database!$E$2:$E$5000,\">\"&$J$2,Inspections_Database!$E$2:$E$5000,\"<\"&$K$2,Inspections_Database!$D$2:$D$5000,\"Tokyo MOU\",Inspections_Database!$A$2:$A$5000,Fleet_List!A4)","v":0},{"$f":"COUNTIFS(Inspections_Database!$E$2:$E$5000,\">\"&$J$2,Inspections_Database!$E$2:$E$5000,\"<\"&$K$2,Inspections_Database!$A$2:$A$5000,Fleet_List!$A$2:$A$296,Inspections_Database!$H$2:$H$5000,\"Yes\",Inspections_Database!$D$2:$D$5000,\"Tokyo MOU\")","v":0},{"$nulls":8},{"$f":"SUMIF(Data_Validation!$B$2:$B$7000,Fleet_List!$A$2:$A$253,Data_Validation!$C$2:$C$7000)","v":0},{"$f":"SUMIF(Data_Validation!$B$2:$B$7000,Fleet_List!$A$2:$A$253,Data_Validation!$D$2:$D$7000)","v":0},{"$f":"SUMIF(Data_Validation!$B$2:$B$7000,Fleet_List!$A$2:$A$253,Data_Validation!$E$2:$E$7000)","v":0},{"$f":"SUMIF(Data_Validation!$B$2:$B$7000,Fleet_List!$A$2:$A$253,Data_Validation!$F$2:$F$7000)","v":0}]
[{"$nulls":3},{"$f":"COUNTIFS(Inspections_Database!$E$2:$E$5000,\">\"&$J$2,Inspections_Database!$E$2:$E$5000,\"<\"&$K$2,Inspections_Database!$D$2:$D$5000,\"Paris MOU\",Inspections_Database!$A$2:$A$5000,Fleet_List!A5)","v":0},{"$f":"COUNTIFS(Inspections_Database!$E$2:$E$5000,\">\"&$J$2,Inspections_Database!$E$2:$E$5000,\"<\"&$K$2,Inspections_Database!$A$2:$A$5000,Fleet_List!$A$2:$A$296,Inspections_Database!$H$2:$H$5000,\"Yes\",Inspections_Database!$D$2:$D$5000,\"Paris MOU\")","v":0},{"$f":"COUNTIFS(Inspections_Database!$E$2:$E$5000,\">\"&$J$2,Inspections_Database!$E$2:$E$5000,\"<\"&$K$2,Inspections_Database!$D$2:$D$5000,\"Tokyo MOU\",Inspections_Database!$A$2:$A$5000,Fleet_List!A5)","v":0},{"$f":"COUNTIFS(Inspections_Database!$E$2:$E$5000,\">\"&$J$2,Inspections_Database!$E$2:$E$5000,\"<\"&$K$2,Inspections_Database!$A$2:$A$5000,Fleet_List!$A$2:$A$296,Inspections_Database!$H$2:$H$5000,\"Yes\",Inspections_Database!$D$2:$D$5000,\"Tokyo MOU\")","v":0},{"$nulls":8},{"$f":"SUMIF(Data_Validation!$B$2:$B$7000,Fleet_List!$A$2:$A$253,Data_Validation!$C$2:$C$7000)","v":0},{"$f":"SUMIF(Data_Validation!$B$2:$B$7000,Fleet_List!$A$2:$A$253,Data_Validation!$D$2:$D$7000)","v":0},{"$f":"SUMIF(Data_Validation!$B$2:$B$7000,Fleet_List!$A$2:$A$253,Data_Validation!$E$2:$E$7000)","v":0},{"$f":"SUMIF(Data_Validation!$B$2:$B$7000,Fleet_List!$A$2:$A$253,Data_Validation!$F$2:$F$7000)","v":0}]
[{"$nulls":3},{"$f":"COUNTIFS(Inspections_Database!$E$2:$E$5000,\">\"&$J$2,Inspections_Database!$E$2:$E$5000,\"<\"&$K$2,Inspections_Database!$D$2:$D$5000,\"Paris MOU\",Inspections_Database!$A$2:$A$5000,Fleet_List!#REF!)","v":0},{"$f":"COUNTIFS(Inspections_Database!$E$2:$E$5000,\">\"&$J$2,Inspections_Database!$E$2:$E$5000,\"<\"&$K$2,Inspections_Database!$A$2:$A$5000,Fleet_List!$A$2:$A$293,Inspections_Database!$H$2:$H$5000,\"Yes\",Inspections_Database!$D$2:$D$5000,\"Paris MOU\")","v":0},{"$f":"COUNTIFS(Inspections_Database!$E$2:$E$5000,\">\"&$J$2,Inspections_Database!$E$2:$E$5000,\"<\"&$K$2,Inspections_Database!$D$2:$D$5000,\"Tokyo MOU\",Inspections_Database!$A$2:$A$5000,Fleet_List!#REF!)","v":0},{"$f":"COUNTIFS(Inspections_Database!$E$2:$E$5000,\">\"&$J$2,Inspections_Database!$E$2:$E$5000,\"<\"&$K$2,Inspections_Database!$A$2:$A$5000,Fleet_List!$A$2:$A$293,Inspections_Database!$H$2:$H$5000,\"Yes\",Inspections_Database!$D$2:$D$5000,\"Tokyo MOU\")","v":0},{"$nulls":8},{"$f":"SUMIF(Data_Validation!$B$2:$B$7000,Fleet_List!$A$2:$A$250,Data_Validation!$C$2:$C$7000)","v":0},{"$f":"SUMIF(Data_Validation!$B$2:$B$7000,Fleet_List!$A$2:$A$250,Data_Validation!$D$2:$D$7000)","v":0},{"$f":"SUMIF(Data_Validation!$B$2:$B$7000,Fleet_List!$A$2:$A$250,Data_Validation!$E$2:$E$7000)","v":0},{"$f":"SUMIF(Data_Validation!$B$2:$B$7000,Fleet_List!$A$2:$A$250,Data_Validation!$F$2:$F$7000)","v":0}]
{"$rows_left_out":3}
{"sheet":"ChartTable","index":11,"n_rows":37,"n_cols":7,"rows_kept":37,"hidden":true}
["Month","Paris Detention Ratio","Paris Deficiency Ratio",null,"Month","Tokyo Detention Ratio","Tokyo Deficiency Ratio"]
["2014-08-01",{"v":0,"d":"0.0"},{"v":0,"d":"0.00"},null,"2014-08-01",{"v":0,"d":"0.0"},{"v":0,"d":"0.00"}]
["2014-09-01",{"v":0,"d":"0.0"},{"v":0,"d":"0.00"},null,"2014-09-01",{"v":0,"d":"0.0"},{"v":0,"d":"0.00"}]
["2014-10-01",{"v":0,"d":"0.0"},{"v":0,"d":"0.00"},null,"2014-10-01",{"v":0,"d":"0.0"},{"v":0,"d":"0.00"}]
["2014-11-01",{"v":0,"d":"0.0"},{"v":0,"d":"0.00"},null,"2014-11-01",{"v":0,"d":"0.0"},{"v":0,"d":"0.00"}]
["2014-12-01",{"v":0,"d":"0.0"},{"v":0,"d":"0.00"},null,"2014-12-01",{"v":0,"d":"0.0"},{"v":0,"d":"0.00"}]
["2015-01-01",{"v":0,"d":"0.0"},{"v":0,"d":"0.00"},null,"2015-01-01",{"v":0,"d":"0.0"},{"v":0,"d":"0.00"}]
["2015-02-01",{"v":0,"d":"0.0"},{"v":0,"d":"0.00"},null,"2015-02-01",{"v":0,"d":"0.0"},{"v":0,"d":"0.00"}]
["2015-03-01",{"v":0,"d":"0.0"},{"v":0,"d":"0.00"},null,"2015-03-01",{"v":0,"d":"0.0"},{"v":0,"d":"0.00"}]
["2015-04-01",{"v":0,"d":"0.0"},{"v":0,"d":"0.00"},null,"2015-04-01",{"v":0,"d":"0.0"},{"v":0,"d":"0.00"}]
{"$rows_left_out":27}